Issues compiling dahdi

OS = Debian 5.0.5
Kernel = 2.6.35
error =
In file included from /usr/src/dahdi-linux-complete-2.3.0.1+2.3.0/linux/drivers/dahdi/voicebus/GpakApi.c:36:
/usr/src/dahdi-linux-complete-2.3.0.1+2.3.0/linux/drivers/dahdi/voicebus/GpakCust.h:114: error: field ‘sem’ has incomplete type
make[4]: *** [/usr/src/dahdi-linux-complete-2.3.0.1+2.3.0/linux/drivers/dahdi/voicebus/GpakApi.o] Error 1
make[3]: *** [/usr/src/dahdi-linux-complete-2.3.0.1+2.3.0/linux/drivers/dahdi/voicebus] Error 2
make[2]: *** [module/usr/src/dahdi-linux-complete-2.3.0.1+2.3.0/linux/drivers/dahdi] Error 2
make[2]: Leaving directory /usr/src/linux-2.6.35.3' make[1]: *** [modules] Error 2 make[1]: Leaving directory/usr/src/dahdi-linux-complete-2.3.0.1+2.3.0/linux’
make: *** [all] Error 2

Any help would be appreciated.

Howdy,

No compilation issues on Ubuntu 10.04 with kernel 2.6.32-24-generic.

Open an issue at:

issues.asterisk.org

Cheers