Error with dahdi-linux

Hello NG

I ran make install of dahdi-linux on a SLES10 SP2 server and i get the following errors. Somebody can help me to solve it?

Thanks Ramon

make install
make -C /lib/modules/ ARCH=i386 SUBDIRS=/home/Addon/dahdi-linux- DAHDI_INCLUDE=/home/Addon/dahdi-linux- DAHDI_MODULES_EXTRA=" " HOTPLUG_FIRMWARE=yes modules DAHDI_BUILD_ALL=m
make[1]: Entering directory /usr/src/linux-' make -C ../../../linux- O=../linux- modules CC [M] /home/Addon/dahdi-linux- /home/Addon/dahdi-linux- In function âztdeth_rcvâ: /home/Addon/dahdi-linux- error: too many arguments to function âskb_linearizeâ make[4]: *** [/home/Addon/dahdi-linux-] Error 1 make[3]: *** [_module_/home/Addon/dahdi-linux-] Error 2 make[2]: *** [modules] Error 2 make[1]: *** [modules] Error 2 make[1]: Leaving directory/usr/src/linux-’
make: *** [modules] Error 2